repent-v
type: LexicalEntry
canonical form: repent
sense: 01800593-v
part of speech: verb
sense: 01800811-v

regret-v
type: LexicalEntry
canonical form: regret
sense: 01800593-v
part of speech: verb

rue-v
type: LexicalEntry
canonical form: rue
sense: 01800593-v
part of speech: verb

01800593-v
type: LexicalConcept
in scheme: en-word.net
definition: feel remorse for; feel sorry for; be contrite about
ili: i30713
lexfile: verb.emotion
part of speech: verb
hypernym: 01775456-v

atone-v
type: LexicalEntry
canonical form: atone
sense: 01800811-v
part of speech: verb

01800811-v
type: LexicalConcept
in scheme: en-word.net
definition: turn away from sin or do penitence
ili: i30714
lexfile: verb.emotion
part of speech: verb
hypernym: 00687584-v