replay-n
type: LexicalEntry
canonical form: replay
sense: 07357795-n
part of speech: noun

rematch-n
type: LexicalEntry
canonical form: rematch
sense: 07357795-n
part of speech: noun

07357795-n
type: LexicalConcept
in scheme: en-word.net
definition: something (especially a game) that is played again
ili: i75279
lexfile: noun.event
part of speech: noun
domain topic: 00456623-n
hypernym: 07356649-n