secrete-v
type: LexicalEntry
canonical form: secrete
sense: 00069066-v
part of speech: verb

release-v
type: LexicalEntry
canonical form: release
sense: 00069066-v
part of speech: verb
sense: 00104622-v
sense: 00270568-v
sense: 00969657-v
sense: 01439155-v
sense: 01477180-v
sense: 01761838-v
sense: 02321284-v
sense: 02426474-v
sense: 02499696-v

00069066-v
type: LexicalConcept
in scheme: en-word.net
definition: generate and separate from cells or bodily fluids
example: secrete digestive juices
example: release a hormone into the blood stream
ili: i22122
lexfile: verb.body
part of speech: verb
hypernym: 00067770-v

liberation-n
type: LexicalEntry
canonical form: liberation
sense: 00096322-n
part of speech: noun
sense: 00217041-n

release-n
type: LexicalEntry
canonical form: release
sense: 00096322-n
part of speech: noun
sense: 00211789-n
sense: 00214561-n
sense: 00217041-n
sense: 00330445-n
sense: 01266940-n
sense: 04080320-n
sense: 04080537-n
sense: 06564805-n
sense: 06760197-n
sense: 07348249-n
sense: 13570875-n

freeing-n
type: LexicalEntry
canonical form: freeing
sense: 00096322-n
part of speech: noun

00096322-n
type: LexicalConcept
in scheme: en-word.net
definition: the act of liberating someone or something
ili: i35905
lexfile: noun.act
part of speech: noun
hypernym: 00035910-n

exhaust-v
type: LexicalEntry
canonical form: exhaust
sense: 00104622-v
part of speech: verb

discharge-v
type: LexicalEntry
canonical form: discharge
sense: 00104622-v
part of speech: verb

expel-v
type: LexicalEntry
canonical form: expel
sense: 00104622-v
part of speech: verb

eject-v
type: LexicalEntry
canonical form: eject
sense: 00104622-v
part of speech: verb

00104622-v
type: LexicalConcept
in scheme: en-word.net
definition: eliminate (a substance)
example: combustion products are exhausted in the engine
example: the plant releases a gas
ili: i22298
lexfile: verb.body
part of speech: verb
hypernym: 02635337-v

tone ending-n
type: LexicalEntry
canonical form: tone ending
sense: 00211789-n
part of speech: noun

00211789-n
type: LexicalConcept
in scheme: en-word.net
definition: (music) the act or manner of terminating a musical phrase or tone
ili: i36513
lexfile: noun.act
part of speech: noun
domain topic: 07034009-n
hypernym: 00210792-n

waiver-n
type: LexicalEntry
canonical form: waiver
sense: 00214561-n
part of speech: noun

discharge-n
type: LexicalEntry
canonical form: discharge
sense: 00214561-n
part of speech: noun
sense: 00217041-n

00214561-n
type: LexicalConcept
in scheme: en-word.net
definition: a formal written statement of relinquishment
ili: i36528
lexfile: noun.act
part of speech: noun
hypernym: 00213657-n

dismissal-n
type: LexicalEntry
canonical form: dismissal
sense: 00217041-n
part of speech: noun

dismission-n
type: LexicalEntry
canonical form: dismission
sense: 00217041-n
part of speech: noun

firing-n
type: LexicalEntry
canonical form: firing
sense: 00217041-n
part of speech: noun

sack-n
type: LexicalEntry
canonical form: sack
sense: 00217041-n
part of speech: noun

sacking-n
type: LexicalEntry
canonical form: sacking
sense: 00217041-n
part of speech: noun

00217041-n
type: LexicalConcept
in scheme: en-word.net
definition: the termination of someone's employment (leaving them free to depart)
ili: i36540
lexfile: noun.act
part of speech: noun
hypernym: 00210792-n

unblock-v
type: LexicalEntry
canonical form: unblock
sense: 00270568-v
part of speech: verb

unfreeze-v
type: LexicalEntry
canonical form: unfreeze
sense: 00270568-v
part of speech: verb

free-v
type: LexicalEntry
canonical form: free
sense: 00270568-v
part of speech: verb
sense: 01761838-v
sense: 02321284-v
sense: 02426474-v
sense: 02499696-v

00270568-v
type: LexicalConcept
in scheme: en-word.net
definition: make (assets) available
example: release the holdings in the dictator's bank account
ili: i23067
lexfile: verb.change
part of speech: verb
hypernym: 02484912-v

spill-n
type: LexicalEntry
canonical form: spill
sense: 00330445-n
part of speech: noun

spillage-n
type: LexicalEntry
canonical form: spillage
sense: 00330445-n
part of speech: noun

00330445-n
type: LexicalConcept
in scheme: en-word.net
definition: the act of allowing a fluid to escape
ili: i37147
lexfile: noun.act
part of speech: noun
hypernym: 00330053-n

publish-v
type: LexicalEntry
canonical form: publish
sense: 00969657-v
part of speech: verb

bring out-v
type: LexicalEntry
canonical form: bring out
sense: 00969657-v
part of speech: verb

put out-v
type: LexicalEntry
canonical form: put out
sense: 00969657-v
part of speech: verb

issue-v
type: LexicalEntry
canonical form: issue
sense: 00969657-v
part of speech: verb

00969657-v
type: LexicalConcept
in scheme: en-word.net
definition: prepare and issue for public distribution or sale
example: publish a magazine or newspaper
ili: i26434
lexfile: verb.communication
part of speech: verb
hypernym: 00956640-v

outlet-n
type: LexicalEntry
canonical form: outlet
sense: 01266940-n
part of speech: noun

vent-n
type: LexicalEntry
canonical form: vent
sense: 01266940-n
part of speech: noun

01266940-n
type: LexicalConcept
in scheme: en-word.net
definition: activity that frees or expresses creative energy or emotion
example: she had no other outlet for her feelings
example: he gave vent to his anger
ili: i42034
lexfile: noun.act
part of speech: noun
hypernym: 00408356-n

turn-v
type: LexicalEntry
canonical form: turn
sense: 01439155-v
part of speech: verb

01439155-v
type: LexicalConcept
in scheme: en-word.net
definition: let (something) fall or spill from a container
example: turn the flour onto a plate
ili: i28910
lexfile: verb.contact
part of speech: verb
hypernym: 01438013-v

let go of-v
type: LexicalEntry
canonical form: let go of
sense: 01477180-v
part of speech: verb

let go-v
type: LexicalEntry
canonical form: let go
sense: 01477180-v
part of speech: verb

relinquish-v
type: LexicalEntry
canonical form: relinquish
sense: 01477180-v
part of speech: verb
sense: 02321284-v

01477180-v
type: LexicalConcept
in scheme: en-word.net
definition: release, as from one's grip
example: Let go of the door handle, please!
example: relinquish your grip on the rope — you won't fall
ili: i29090
lexfile: verb.contact
part of speech: verb
hypernym: 02372362-v

liberate-v
type: LexicalEntry
canonical form: liberate
sense: 01761838-v
part of speech: verb
sense: 02426474-v

01761838-v
type: LexicalConcept
in scheme: en-word.net
definition: release (gas or energy) as a result of a chemical reaction or physical decomposition
ili: i30534
lexfile: verb.creation
part of speech: verb
domain topic: 06094057-n
hypernym: 01630392-v

resign-v
type: LexicalEntry
canonical form: resign
sense: 02321284-v
part of speech: verb

give up-v
type: LexicalEntry
canonical form: give up
sense: 02321284-v
part of speech: verb

02321284-v
type: LexicalConcept
in scheme: en-word.net
definition: part with a possession or right
example: I am relinquishing my bedroom to the long-term house guest
example: resign a claim to the throne
ili: i33317
lexfile: verb.possession
part of speech: verb
hypernym: 02235554-v

unloose-v
type: LexicalEntry
canonical form: unloose
sense: 02426474-v
part of speech: verb

unloosen-v
type: LexicalEntry
canonical form: unloosen
sense: 02426474-v
part of speech: verb

loose-v
type: LexicalEntry
canonical form: loose
sense: 02426474-v
part of speech: verb

02426474-v
type: LexicalConcept
in scheme: en-word.net
definition: grant freedom to; free from confinement
ili: i33841
lexfile: verb.social
part of speech: verb
hypernym: 00126072-v

02499696-v
type: LexicalConcept
in scheme: en-word.net
definition: make (information) available for publication
example: release the list with the names of the prisoners
ili: i34191
lexfile: verb.social
part of speech: verb
hypernym: 02484912-v

04080320-n
type: LexicalConcept
in scheme: en-word.net
definition: merchandise issued for sale or public showing (especially a record or film)
example: a new release from the London Symphony Orchestra
ili: i58071
lexfile: noun.artifact
part of speech: noun
hypernym: 03754377-n

button-n
type: LexicalEntry
canonical form: button
sense: 04080537-n
part of speech: noun

04080537-n
type: LexicalConcept
in scheme: en-word.net
definition: a device that when pressed will release part of a mechanism
ili: i58072
lexfile: noun.artifact
part of speech: noun
hypernym: 03187746-n

acquittance-n
type: LexicalEntry
canonical form: acquittance
sense: 06564805-n
part of speech: noun

06564805-n
type: LexicalConcept
in scheme: en-word.net
definition: a legal document evidencing the discharge of a debt or obligation
ili: i70900
lexfile: noun.communication
part of speech: noun
domain topic: 08458195-n
hypernym: 06491336-n

handout-n
type: LexicalEntry
canonical form: handout
sense: 06760197-n
part of speech: noun

press release-n
type: LexicalEntry
canonical form: press release
sense: 06760197-n
part of speech: noun

06760197-n
type: LexicalConcept
in scheme: en-word.net
definition: an announcement distributed to members of the press in order to supplement or replace an oral presentation
ili: i71952
lexfile: noun.communication
part of speech: noun
hypernym: 06759293-n

passing-n
type: LexicalEntry
canonical form: passing
sense: 07348249-n
part of speech: noun

loss-n
type: LexicalEntry
canonical form: loss
sense: 07348249-n
part of speech: noun

departure-n
type: LexicalEntry
canonical form: departure
sense: 07348249-n
part of speech: noun

exit-n
type: LexicalEntry
canonical form: exit
sense: 07348249-n
part of speech: noun

expiration-n
type: LexicalEntry
canonical form: expiration
sense: 07348249-n
part of speech: noun

going-n
type: LexicalEntry
canonical form: going
sense: 07348249-n
part of speech: noun

07348249-n
type: LexicalConcept
in scheme: en-word.net
definition: euphemistic expressions for death
example: thousands mourned his passing
ili: i75233
lexfile: noun.event
part of speech: noun
exemplifies: 06617399-n
hypernym: 07370091-n

13570875-n
type: LexicalConcept
in scheme: en-word.net
definition: a process that liberates or discharges something
example: there was a sudden release of oxygen
example: the release of iodine from the thyroid gland
ili: i107914
lexfile: noun.process
part of speech: noun
hypernym: 13540166-n