regimen-n
type: LexicalEntry
canonical form: regimen
sense: 05918179-n
part of speech: noun

regime-n
type: LexicalEntry
canonical form: regime
sense: 05918179-n
part of speech: noun

05918179-n
type: LexicalConcept
in scheme: en-word.net
definition: (medicine) a systematic plan for therapy (often including diet)
ili: i67894
lexfile: noun.cognition
part of speech: noun
domain topic: 06052606-n
hypernym: 05907175-n