replenish-v
type: LexicalEntry
canonical form: replenish
sense: 00454758-v
part of speech: verb

refill-v
type: LexicalEntry
canonical form: refill
sense: 00454758-v
part of speech: verb

fill again-v
type: LexicalEntry
canonical form: fill again
sense: 00454758-v
part of speech: verb

00454758-v
type: LexicalConcept
in scheme: en-word.net
definition: fill something that had previously been emptied
example: refill my glass, please
ili: i23989
lexfile: verb.change
part of speech: verb
hypernym: 00453467-v

refill-n
type: LexicalEntry
canonical form: refill
sense: 04075167-n
part of speech: noun
sense: 04075373-n

04075167-n
type: LexicalConcept
in scheme: en-word.net
definition: a commercial product that refills a container with its appropriate contents
example: he got a refill for his ball-point pen
example: he got a refill for his notebook
ili: i58045
lexfile: noun.artifact
part of speech: noun
hypernym: 03754377-n

04075373-n
type: LexicalConcept
in scheme: en-word.net
definition: a prescription drug that is provided again
example: he got a refill of his prescription
example: the prescription specified only one refill
ili: i58046
lexfile: noun.artifact
part of speech: noun
hypernym: 04005638-n