redevelop-v
type: LexicalEntry
canonical form: redevelop
sense: 00172271-v
part of speech: verb
sense: 00928281-v
sense: 02143834-v

00172271-v
type: LexicalConcept
in scheme: en-word.net
definition: change the plans for the use of (land)
ili: i22570
lexfile: verb.change
part of speech: verb
hypernym: 00171865-v

reformulate-v
type: LexicalEntry
canonical form: reformulate
sense: 00928281-v
part of speech: verb

00928281-v
type: LexicalConcept
in scheme: en-word.net
definition: formulate or develop again, of an improved theory or hypothesis
ili: i26242
lexfile: verb.communication
part of speech: verb
hypernym: 00927844-v

02143834-v
type: LexicalConcept
in scheme: en-word.net
definition: develop for a second time, in order to improve the contrast, colour, etc., of a negative or print
ili: i32450
lexfile: verb.perception
part of speech: verb
domain topic: 13557997-n
hypernym: 02143239-v