restructure-v
type: LexicalEntry
canonical form: restructure
sense: 00405308-v
part of speech: verb

reconstitute-v
type: LexicalEntry
canonical form: reconstitute
sense: 00405308-v
part of speech: verb

00405308-v
type: LexicalConcept
in scheme: en-word.net
definition: construct or form anew or provide with a new structure
example: After his accident, he had to restructure his life
example: The governing board was reconstituted
ili: i23751
lexfile: verb.change
part of speech: verb
hypernym: 00405129-v