reclassify-v
type: LexicalEntry
canonical form: reclassify
sense: 00657463-v
part of speech: verb

00657463-v
type: LexicalConcept
in scheme: en-word.net
definition: classify anew, change the previous classification
example: The zoologists had to reclassify the mollusks after they found new species
ili: i25005
lexfile: verb.cognition
part of speech: verb
hypernym: 00656296-v