reception-n
type: LexicalEntry
canonical form: reception
sense: 00091073-n
part of speech: noun
sense: 00140739-n
sense: 06291693-n
sense: 06643359-n
sense: 08271252-n

receipt-n
type: LexicalEntry
canonical form: receipt
sense: 00091073-n
part of speech: noun

00091073-n
type: LexicalConcept
in scheme: en-word.net
definition: the act of receiving
ili: i35877
lexfile: noun.act
part of speech: noun
hypernym: 00042637-n

00140739-n
type: LexicalConcept
in scheme: en-word.net
definition: (American football) the act of catching a pass in football
example: the tight end made a great reception on the 20 yard line
ili: i36150
lexfile: noun.act
part of speech: noun
domain topic: 00470726-n
hypernym: 00139776-n

06291693-n
type: LexicalConcept
in scheme: en-word.net
definition: quality or fidelity of a received broadcast
ili: i69517
lexfile: noun.communication
part of speech: noun
hypernym: 06287350-n

response-n
type: LexicalEntry
canonical form: response
sense: 06643359-n
part of speech: noun

06643359-n
type: LexicalConcept
in scheme: en-word.net
definition: the manner in which something is greeted
example: she did not expect the cold reception she received from her superiors
ili: i71326
lexfile: noun.communication
part of speech: noun
hypernym: 06642524-n

08271252-n
type: LexicalConcept
in scheme: en-word.net
definition: a formal party of people; as after a wedding
ili: i80509
lexfile: noun.group
part of speech: noun
hypernym: 07462241-n
mero part: 08450087-n