reassure-v
type: LexicalEntry
canonical form: reassure
sense: 01021817-v
part of speech: verb

01021817-v
type: LexicalConcept
in scheme: en-word.net
definition: give reassurance to; give or restore confidence in; cause to feel sure or certain
example: I reassured him that we were safe
ili: i26676
lexfile: verb.communication
part of speech: verb
hypernym: 00778313-v