irradiate-v
type: LexicalEntry
canonical form: irradiate
sense: 00292206-v
part of speech: verb

ray-v
type: LexicalEntry
canonical form: ray
sense: 00292206-v
part of speech: verb
sense: 02692794-v
sense: 02774389-v

00292206-v
type: LexicalConcept
in scheme: en-word.net
definition: expose to radiation
example: irradiate food
ili: i23184
lexfile: verb.change
part of speech: verb
hypernym: 00516235-v

ray-n
type: LexicalEntry
canonical form: ray
sense: 01498342-n
part of speech: noun
sense: 01903360-n
sense: 06881495-n
sense: 11448137-n
sense: 11448493-n
sense: 13152275-n
sense: 13936442-n

01498342-n
type: LexicalConcept
in scheme: en-word.net
definition: cartilaginous fishes having horizontally flattened bodies and enlarged winglike pectoral fins with gills on the underside; most swim by moving the pectoral fins
ili: i43166
lexfile: noun.animal
part of speech: noun
hypernym: 01484712-n

01903360-n
type: LexicalConcept
in scheme: en-word.net
definition: any of the stiff bony spines in the fin of a fish
ili: i45317
lexfile: noun.animal
part of speech: noun
hypernym: 01903129-n

radiate-v
type: LexicalEntry
canonical form: radiate
sense: 02692794-v
part of speech: verb

02692794-v
type: LexicalConcept
in scheme: en-word.net
definition: extend or spread outward from a center or focus or inward towards a center
example: spokes radiate from the hub of the wheel
example: This plants radiate spines in all directions
ili: i35088
lexfile: verb.stative
part of speech: verb
hypernym: 02691775-v

02774389-v
type: LexicalConcept
in scheme: en-word.net
definition: emit as rays
example: That tower rays a laser beam for miles across the sky
ili: i35521
lexfile: verb.weather
part of speech: verb
hypernym: 02773266-v

re-n
type: LexicalEntry
canonical form: re
sense: 06881495-n
part of speech: noun

06881495-n
type: LexicalConcept
in scheme: en-word.net
definition: the syllable naming the second (supertonic) note of any major scale in solmization
ili: i72578
lexfile: noun.communication
part of speech: noun
hypernym: 06881093-n

beam-n
type: LexicalEntry
canonical form: beam
sense: 11448137-n
part of speech: noun
sense: 11448493-n

beam of light-n
type: LexicalEntry
canonical form: beam of light
sense: 11448137-n
part of speech: noun

light beam-n
type: LexicalEntry
canonical form: light beam
sense: 11448137-n
part of speech: noun

ray of light-n
type: LexicalEntry
canonical form: ray of light
sense: 11448137-n
part of speech: noun

shaft-n
type: LexicalEntry
canonical form: shaft
sense: 11448137-n
part of speech: noun

shaft of light-n
type: LexicalEntry
canonical form: shaft of light
sense: 11448137-n
part of speech: noun

irradiation-n
type: LexicalEntry
canonical form: irradiation
sense: 11448137-n
part of speech: noun

11448137-n
type: LexicalConcept
in scheme: en-word.net
definition: a column of light (as from a beacon)
ili: i97639
lexfile: noun.phenomenon
part of speech: noun
hypernym: 11494354-n

electron beam-n
type: LexicalEntry
canonical form: electron beam
sense: 11448493-n
part of speech: noun

11448493-n
type: LexicalConcept
in scheme: en-word.net
definition: a group of nearly parallel lines of electromagnetic radiation
ili: i97640
lexfile: noun.phenomenon
part of speech: noun
hypernym: 11471253-n

13152275-n
type: LexicalConcept
in scheme: en-word.net
definition: a branch of an umbel or an umbelliform inflorescence
ili: i105653
lexfile: noun.plant
part of speech: noun
hypernym: 13152915-n

13936442-n
type: LexicalConcept
in scheme: en-word.net
definition: (mathematics) a straight line extending from a point
ili: i110061
lexfile: noun.shape
part of speech: noun
domain topic: 06009822-n
hypernym: 13936278-n