ration-v
type: LexicalEntry
canonical form: ration
sense: 02239585-v
part of speech: verb
sense: 02239770-v

ration out-v
type: LexicalEntry
canonical form: ration out
sense: 02239585-v
part of speech: verb

02239585-v
type: LexicalConcept
in scheme: en-word.net
definition: distribute in rations, as in the army
example: Cigarettes are rationed
ili: i32915
lexfile: verb.possession
part of speech: verb
hypernym: 02238869-v

02239770-v
type: LexicalConcept
in scheme: en-word.net
definition: restrict the consumption of a relatively scarce commodity, as during war
example: Bread was rationed during the siege of the city
ili: i32916
lexfile: verb.possession
part of speech: verb
hypernym: 00237442-v

ration-n
type: LexicalEntry
canonical form: ration
sense: 07581290-n
part of speech: noun
sense: 13307122-n

07581290-n
type: LexicalConcept
in scheme: en-word.net
definition: the food allowance for one day (especially for service personnel)
example: the rations should be nutritionally balanced
ili: i76511
lexfile: noun.food
part of speech: noun
hypernym: 07576217-n

13307122-n
type: LexicalConcept
in scheme: en-word.net
definition: a fixed portion that is allotted (especially in times of scarcity)
ili: i106489
lexfile: noun.possession
part of speech: noun
hypernym: 13306199-n