rat terrier-n
type: LexicalEntry
canonical form: rat terrier
sense: 02097214-n
part of speech: noun

ratter-n
type: LexicalEntry
canonical form: ratter
sense: 02097214-n
part of speech: noun

02097214-n
type: LexicalConcept
in scheme: en-word.net
definition: any of several breeds of terrier developed to catch rats
ili: i46424
lexfile: noun.animal
part of speech: noun
hypernym: 02095120-n