rain-n
type: LexicalEntry
canonical form: rain
sense: 15033174-n
part of speech: noun

rainwater-n
type: LexicalEntry
canonical form: rainwater
sense: 15033174-n
part of speech: noun

15033174-n
type: LexicalConcept
in scheme: en-word.net
definition: drops of fresh water that fall as precipitation from clouds
ili: i116026
lexfile: noun.substance
part of speech: noun
hypernym: 15033893-n