pseudoephedrine-n
type: LexicalEntry
canonical form: pseudoephedrine
sense: 14738374-n
part of speech: noun

14738374-n
type: LexicalConcept
in scheme: en-word.net
definition: poisonous crystalline alkaloid occurring with ephedrine and isomorphic with it
ili: i114319
lexfile: noun.substance
part of speech: noun
hypernym: 14736853-n