dry-n
type: LexicalEntry
canonical form: dry
sense: 10057647-n
part of speech: noun

prohibitionist-n
type: LexicalEntry
canonical form: prohibitionist
sense: 10057647-n
part of speech: noun

10057647-n
type: LexicalConcept
in scheme: en-word.net
definition: a reformer who opposes the use of intoxicating beverages
ili: i89646
lexfile: noun.person
part of speech: noun
hypernym: 10534787-n