priory-n
type: LexicalEntry
canonical form: priory
sense: 04011573-n
part of speech: noun

04011573-n
type: LexicalConcept
in scheme: en-word.net
definition: religious residence in a monastery governed by a prior or a convent governed by a prioress
ili: i57683
lexfile: noun.artifact
part of speech: noun
hypernym: 04081060-n