postulation-n
type: LexicalEntry
canonical form: postulation
sense: 06745976-n
part of speech: noun

predication-n
type: LexicalEntry
canonical form: predication
sense: 06745976-n
part of speech: noun

06745976-n
type: LexicalConcept
in scheme: en-word.net
definition: (logic) a declaration of something self-evident; something that can be assumed as the basis for argument
ili: i71883
lexfile: noun.communication
part of speech: noun
domain topic: 06173467-n
hypernym: 06738626-n