realism-n
type: LexicalEntry
canonical form: realism
sense: 05159116-n
part of speech: noun

pragmatism-n
type: LexicalEntry
canonical form: pragmatism
sense: 05159116-n
part of speech: noun
sense: 05983665-n

05159116-n
type: LexicalConcept
in scheme: en-word.net
definition: the attribute of accepting the facts of life and favoring practicality and literal truth
ili: i64055
lexfile: noun.attribute
part of speech: noun
hypernym: 05158335-n

05983665-n
type: LexicalConcept
in scheme: en-word.net
definition: (philosophy) the doctrine that practical consequences are the criteria of knowledge and meaning and value
ili: i68221
lexfile: noun.cognition
part of speech: noun
domain topic: 06168062-n
hypernym: 06177044-n