medicine-n
type: LexicalEntry
canonical form: medicine
sense: 00613447-n
part of speech: noun

practice of medicine-n
type: LexicalEntry
canonical form: practice of medicine
sense: 00613447-n
part of speech: noun

00613447-n
type: LexicalConcept
in scheme: en-word.net
definition: the learned profession that is mastered by graduate training in a medical school and that is devoted to preventing or alleviating or curing diseases and injuries
example: he studied medicine at Harvard
ili: i38643
lexfile: noun.act
part of speech: noun
domain topic: 06052606-n
hypernym: 00611641-n