powder-v
type: LexicalEntry
canonical form: powder
sense: 00041904-v
part of speech: verb
sense: 00332964-v

00041904-v
type: LexicalConcept
in scheme: en-word.net
definition: apply powder to
example: She powdered her nose
example: The King wears a powdered wig
ili: i21979
lexfile: verb.body
part of speech: verb
hypernym: 00040659-v

powderize-v
type: LexicalEntry
canonical form: powderize
sense: 00332964-v
part of speech: verb

powderise-v
type: LexicalEntry
canonical form: powderise
sense: 00332964-v
part of speech: verb

pulverize-v
type: LexicalEntry
canonical form: pulverize
sense: 00332964-v
part of speech: verb

pulverise-v
type: LexicalEntry
canonical form: pulverise
sense: 00332964-v
part of speech: verb

00332964-v
type: LexicalConcept
in scheme: en-word.net
definition: make into a powder by breaking up or cause to become dust
example: pulverize the grains
ili: i23395
lexfile: verb.change
part of speech: verb
hypernym: 00398482-v
similar: 00333255-v

powder-n
type: LexicalEntry
canonical form: powder
sense: 04000366-n
part of speech: noun
sense: 15021579-n
sense: 15040881-n

04000366-n
type: LexicalConcept
in scheme: en-word.net
definition: any of various cosmetic or medical preparations dispensed in the form of a pulverized powder
ili: i57616
lexfile: noun.artifact
part of speech: noun
hypernym: 04454577-n
hypernym: 03745652-n

pulverization-n
type: LexicalEntry
canonical form: pulverization
sense: 15021579-n
part of speech: noun

pulverisation-n
type: LexicalEntry
canonical form: pulverisation
sense: 15021579-n
part of speech: noun

15021579-n
type: LexicalConcept
in scheme: en-word.net
definition: a solid substance in the form of tiny loose particles; a solid that has been pulverized
ili: i115955
lexfile: noun.substance
part of speech: noun
hypernym: 15071467-n

gunpowder-n
type: LexicalEntry
canonical form: gunpowder
sense: 15040881-n
part of speech: noun

15040881-n
type: LexicalConcept
in scheme: en-word.net
definition: a mixture of potassium nitrate, charcoal, and sulfur in a 75:15:10 ratio which is used in gunnery, time fuses, and fireworks
ili: i116064
lexfile: noun.substance
part of speech: noun
hypernym: 03309675-n