port-n
type: LexicalEntry
canonical form: port
sense: 03991266-n
part of speech: noun

embrasure-n
type: LexicalEntry
canonical form: embrasure
sense: 03991266-n
part of speech: noun

porthole-n
type: LexicalEntry
canonical form: porthole
sense: 03991266-n
part of speech: noun
sense: 03992920-n

03991266-n
type: LexicalConcept
in scheme: en-word.net
definition: an opening (in a wall or ship or armored vehicle) for firing through
ili: i57559
lexfile: noun.artifact
part of speech: noun
domain topic: 04201332-n
hypernym: 03854249-n

03992920-n
type: LexicalConcept
in scheme: en-word.net
definition: a window in a ship or airplane
ili: i57569
lexfile: noun.artifact
part of speech: noun
hypernym: 04594951-n
mero part: 03170879-n