port-n
type: LexicalEntry
canonical form: port
sense: 07917065-n
part of speech: noun

port wine-n
type: LexicalEntry
canonical form: port wine
sense: 07917065-n
part of speech: noun

07917065-n
type: LexicalConcept
in scheme: en-word.net
definition: sweet dark-red dessert wine originally from Portugal
ili: i78775
lexfile: noun.food
part of speech: noun
hypernym: 07916646-n