port-v
type: LexicalEntry
canonical form: port
sense: 00588439-v
part of speech: verb
sense: 01173958-v
sense: 01241766-v
sense: 01453403-v
sense: 01912197-v
sense: 01983099-v
sense: 02091739-v
sense: 02095121-v

00588439-v
type: LexicalConcept
in scheme: en-word.net
definition: modify (software) for use on a different machine or platform
ili: i24701
lexfile: verb.change
part of speech: verb
hypernym: 00126072-v

01173958-v
type: LexicalConcept
in scheme: en-word.net
definition: drink port
example: We were porting all in the club after dinner
ili: i27473
lexfile: verb.consumption
part of speech: verb
hypernym: 01173463-v

01241766-v
type: LexicalConcept
in scheme: en-word.net
definition: carry or hold with both hands diagonally across the body, especially of weapons
example: port a rifle
ili: i27824
lexfile: verb.contact
part of speech: verb
hypernym: 01452567-v

01453403-v
type: LexicalConcept
in scheme: en-word.net
definition: carry, bear, convey, or bring
example: The small canoe could be ported easily
ili: i28976
lexfile: verb.contact
part of speech: verb
hypernym: 01452567-v

01912197-v
type: LexicalConcept
in scheme: en-word.net
definition: turn or go to the port or left side, of a ship
example: The big ship was slowly porting
ili: i31252
lexfile: verb.motion
part of speech: verb
hypernym: 01911251-v

01983099-v
type: LexicalConcept
in scheme: en-word.net
definition: land at or reach a port
example: The ship finally ported
ili: i31628
lexfile: verb.motion
part of speech: verb
hypernym: 01983915-v
similar: 02091739-v

port-a
type: LexicalEntry
canonical form: port
sense: 02041149-s
part of speech: adjective

larboard-a
type: LexicalEntry
canonical form: larboard
sense: 02041149-s
part of speech: adjective

02041149-s
type: LexicalConcept
in scheme: en-word.net
definition: located on the left side of a ship or aircraft
ili: i11145
lexfile: adj.all
part of speech: adjective satellite
similar: https://en-word.net/synset/02040360-a

02091739-v
type: LexicalConcept
in scheme: en-word.net
definition: bring to port
example: the captain ported the ship at night
ili: i32187
lexfile: verb.motion
part of speech: verb
hypernym: 02081903-v
similar: 01983099-v

02095121-v
type: LexicalConcept
in scheme: en-word.net
definition: put or turn on the left side, of a ship
example: port the helm
ili: i32206
lexfile: verb.motion
part of speech: verb
hypernym: 02094251-v

interface-n
type: LexicalEntry
canonical form: interface
sense: 03583825-n
part of speech: noun

port-n
type: LexicalEntry
canonical form: port
sense: 03583825-n
part of speech: noun
sense: 03648242-n
sense: 03991266-n
sense: 07917065-n
sense: 08651532-n

03583825-n
type: LexicalConcept
in scheme: en-word.net
definition: (computer science) computer circuit consisting of the hardware and associated circuitry that links one device with another (especially a computer and a hard disk drive or other peripherals)
ili: i55146
lexfile: noun.artifact
part of speech: noun
domain topic: 06138021-n
hypernym: 03088462-n

larboard-n
type: LexicalEntry
canonical form: larboard
sense: 03648242-n
part of speech: noun

03648242-n
type: LexicalConcept
in scheme: en-word.net
definition: the left side of a ship or aircraft to someone who is aboard and facing the bow or nose
ili: i55541
lexfile: noun.artifact
part of speech: noun
hypernym: 04220693-n

embrasure-n
type: LexicalEntry
canonical form: embrasure
sense: 03991266-n
part of speech: noun

porthole-n
type: LexicalEntry
canonical form: porthole
sense: 03991266-n
part of speech: noun

03991266-n
type: LexicalConcept
in scheme: en-word.net
definition: an opening (in a wall or ship or armored vehicle) for firing through
ili: i57559
lexfile: noun.artifact
part of speech: noun
domain topic: 04201332-n
hypernym: 03854249-n

port wine-n
type: LexicalEntry
canonical form: port wine
sense: 07917065-n
part of speech: noun

07917065-n
type: LexicalConcept
in scheme: en-word.net
definition: sweet dark-red dessert wine originally from Portugal
ili: i78775
lexfile: noun.food
part of speech: noun
hypernym: 07916646-n

08651532-n
type: LexicalConcept
in scheme: en-word.net
definition: a place (seaport or airport) where people and merchandise can enter or leave a country
ili: i82351
lexfile: noun.location
part of speech: noun
hypernym: 08596234-n