pomade-v
type: LexicalEntry
canonical form: pomade
sense: 00039815-v
part of speech: verb

00039815-v
type: LexicalConcept
in scheme: en-word.net
definition: apply pomade to (hair)
ili: i21968
lexfile: verb.body
part of speech: verb
hypernym: 00040084-v

pomade-n
type: LexicalEntry
canonical form: pomade
sense: 03986384-n
part of speech: noun

pomatum-n
type: LexicalEntry
canonical form: pomatum
sense: 03986384-n
part of speech: noun

03986384-n
type: LexicalConcept
in scheme: en-word.net
definition: hairdressing consisting of a perfumed oil or ointment
ili: i57526
lexfile: noun.artifact
part of speech: noun
hypernym: 03480946-n