polarize-v
type: LexicalEntry
canonical form: polarize
sense: 00488118-v
part of speech: verb
sense: 00488286-v
sense: 00488490-v

polarise-v
type: LexicalEntry
canonical form: polarise
sense: 00488118-v
part of speech: verb
sense: 00488286-v
sense: 00488490-v

00488118-v
type: LexicalConcept
in scheme: en-word.net
definition: become polarized in a conflict or contrasting situation
ili: i24144
lexfile: verb.change
part of speech: verb
hypernym: 01560556-v

00488286-v
type: LexicalConcept
in scheme: en-word.net
definition: cause to concentrate about two conflicting or contrasting positions
ili: i24145
lexfile: verb.change
part of speech: verb
hypernym: 01559703-v

00488490-v
type: LexicalConcept
in scheme: en-word.net
definition: cause to vibrate in a definite pattern
example: polarize light waves
ili: i24146
lexfile: verb.change
part of speech: verb
domain topic: 06100457-n
hypernym: 00126072-v