point-v
type: LexicalEntry
canonical form: point
sense: 00262843-v
part of speech: verb
sense: 00393662-v
sense: 00923271-v
sense: 00925764-v
sense: 00926226-v
sense: 01153025-v
sense: 01154680-v
sense: 01155136-v
sense: 01591977-v
sense: 01592145-v
sense: 01592284-v
sense: 01932107-v
sense: 01935739-v
sense: 02719059-v

repoint-v
type: LexicalEntry
canonical form: repoint
sense: 00262843-v
part of speech: verb

00262843-v
type: LexicalConcept
in scheme: en-word.net
definition: repair the joints of bricks
example: point a chimney
ili: i23025
lexfile: verb.change
part of speech: verb
hypernym: 00261534-v

sharpen-v
type: LexicalEntry
canonical form: sharpen
sense: 00393662-v
part of speech: verb

taper-v
type: LexicalEntry
canonical form: taper
sense: 00393662-v
part of speech: verb

00393662-v
type: LexicalConcept
in scheme: en-word.net
definition: give a point to
example: The candles are tapered
ili: i23699
lexfile: verb.change
part of speech: verb
hypernym: 00140787-v

bespeak-v
type: LexicalEntry
canonical form: bespeak
sense: 00923271-v
part of speech: verb

betoken-v
type: LexicalEntry
canonical form: betoken
sense: 00923271-v
part of speech: verb

indicate-v
type: LexicalEntry
canonical form: indicate
sense: 00923271-v
part of speech: verb
sense: 00925764-v

signal-v
type: LexicalEntry
canonical form: signal
sense: 00923271-v
part of speech: verb

00923271-v
type: LexicalConcept
in scheme: en-word.net
definition: be a signal for or a symptom of
example: These symptoms indicate a serious illness
example: Her behavior points to a severe neurosis
example: The economic indicators signal that the euro is undervalued
ili: i26217
lexfile: verb.communication
part of speech: verb
hypernym: 00954556-v

designate-v
type: LexicalEntry
canonical form: designate
sense: 00925764-v
part of speech: verb

show-v
type: LexicalEntry
canonical form: show
sense: 00925764-v
part of speech: verb

00925764-v
type: LexicalConcept
in scheme: en-word.net
definition: indicate a place, direction, person, or thing; either spatially or figuratively
example: I showed the customer the glove section
example: He pointed to the empty parking space
example: he indicated his opponents
ili: i26230
lexfile: verb.communication
part of speech: verb
hypernym: 00833312-v

00926226-v
type: LexicalConcept
in scheme: en-word.net
definition: indicate the presence of (game) by standing and pointing with the muzzle
example: the dog pointed the dead duck
ili: i26231
lexfile: verb.communication
part of speech: verb
hypernym: 00925764-v

target-v
type: LexicalEntry
canonical form: target
sense: 01153025-v
part of speech: verb

aim-v
type: LexicalEntry
canonical form: aim
sense: 01153025-v
part of speech: verb

place-v
type: LexicalEntry
canonical form: place
sense: 01153025-v
part of speech: verb

direct-v
type: LexicalEntry
canonical form: direct
sense: 01153025-v
part of speech: verb
sense: 01935739-v

01153025-v
type: LexicalConcept
in scheme: en-word.net
definition: intend (something) to move towards a certain goal
example: He aimed his fists towards his opponent's face
example: criticism directed at her superior
example: direct your anger towards others, not towards yourself
ili: i27377
lexfile: verb.competition
part of speech: verb
hypernym: 01153576-v

charge-v
type: LexicalEntry
canonical form: charge
sense: 01154680-v
part of speech: verb

level-v
type: LexicalEntry
canonical form: level
sense: 01154680-v
part of speech: verb

01154680-v
type: LexicalConcept
in scheme: en-word.net
definition: direct into a position for use
example: point a gun
example: He charged his weapon at me
ili: i27384
lexfile: verb.competition
part of speech: verb
hypernym: 01153576-v
similar: 01155136-v

01155136-v
type: LexicalConcept
in scheme: en-word.net
definition: be positionable in a specified manner
example: The gun points with ease
ili: i27387
lexfile: verb.competition
part of speech: verb
hypernym: 02661230-v
similar: 01154680-v

01591977-v
type: LexicalConcept
in scheme: en-word.net
definition: mark (a psalm text) to indicate the points at which the music changes
ili: i29674
lexfile: verb.contact
part of speech: verb
hypernym: 01591414-v

01592145-v
type: LexicalConcept
in scheme: en-word.net
definition: mark with diacritics
example: point the letter
ili: i29675
lexfile: verb.contact
part of speech: verb
hypernym: 01591414-v

01592284-v
type: LexicalConcept
in scheme: en-word.net
definition: mark (Hebrew words) with diacritics
ili: i29676
lexfile: verb.contact
part of speech: verb
hypernym: 01591414-v

luff-v
type: LexicalEntry
canonical form: luff
sense: 01932107-v
part of speech: verb

01932107-v
type: LexicalConcept
in scheme: en-word.net
definition: sail close to the wind
ili: i31357
lexfile: verb.motion
part of speech: verb
domain topic: 00817462-n
hypernym: 01949375-v

steer-v
type: LexicalEntry
canonical form: steer
sense: 01935739-v
part of speech: verb

maneuver-v
type: LexicalEntry
canonical form: maneuver
sense: 01935739-v
part of speech: verb

manoeuver-v
type: LexicalEntry
canonical form: manoeuver
sense: 01935739-v
part of speech: verb

manoeuvre-v
type: LexicalEntry
canonical form: manoeuvre
sense: 01935739-v
part of speech: verb

head-v
type: LexicalEntry
canonical form: head
sense: 01935739-v
part of speech: verb

guide-v
type: LexicalEntry
canonical form: guide
sense: 01935739-v
part of speech: verb

channelize-v
type: LexicalEntry
canonical form: channelize
sense: 01935739-v
part of speech: verb

channelise-v
type: LexicalEntry
canonical form: channelise
sense: 01935739-v
part of speech: verb

01935739-v
type: LexicalConcept
in scheme: en-word.net
definition: direct the course; determine the direction of travelling
ili: i31378
lexfile: verb.motion
part of speech: verb
hypernym: 02445887-v

orient-v
type: LexicalEntry
canonical form: orient
sense: 02719059-v
part of speech: verb

02719059-v
type: LexicalConcept
in scheme: en-word.net
definition: be oriented
example: The weather vane points North
example: the dancers toes pointed outward
ili: i35228
lexfile: verb.stative
part of speech: verb
hypernym: 02696550-v

distributor point-n
type: LexicalEntry
canonical form: distributor point
sense: 03218529-n
part of speech: noun

breaker point-n
type: LexicalEntry
canonical form: breaker point
sense: 03218529-n
part of speech: noun

point-n
type: LexicalEntry
canonical form: point
sense: 03218529-n
part of speech: noun
sense: 03980573-n
sense: 03981029-n
sense: 03981127-n
sense: 04739165-n
sense: 04739307-n
sense: 05078725-n
sense: 05825971-n
sense: 05874582-n
sense: 05992951-n
sense: 06494090-n
sense: 06619161-n
sense: 06825147-n
sense: 06834918-n
sense: 06856570-n
sense: 08637636-n
sense: 09419340-n
sense: 13421323-n
sense: 13631405-n
sense: 13734391-n
sense: 13817097-n
sense: 13852504-n
sense: 13925175-n
sense: 13934887-n
sense: 13962925-n
sense: 15205381-n

03218529-n
type: LexicalConcept
in scheme: en-word.net
definition: a contact in the distributor; as the rotor turns its projecting arm contacts them and current flows to the spark plugs
ili: i53000
lexfile: noun.artifact
part of speech: noun
hypernym: 03098248-n

03980573-n
type: LexicalConcept
in scheme: en-word.net
definition: sharp end
example: he stuck the point of the knife into a tree
example: he broke the point of his pencil
ili: i57492
lexfile: noun.artifact
part of speech: noun
hypernym: 08583557-n

power point-n
type: LexicalEntry
canonical form: power point
sense: 03981029-n
part of speech: noun

03981029-n
type: LexicalConcept
in scheme: en-word.net
definition: a wall socket
ili: i57493
lexfile: noun.artifact
part of speech: noun
domain region: 08879115-n
hypernym: 04556057-n

gunpoint-n
type: LexicalEntry
canonical form: gunpoint
sense: 03981127-n
part of speech: noun

03981127-n
type: LexicalConcept
in scheme: en-word.net
definition: the gun muzzle's direction
example: he held me up at the point of a gun
ili: i57494
lexfile: noun.artifact
part of speech: noun
hypernym: 03474810-n

spot-n
type: LexicalEntry
canonical form: spot
sense: 04739165-n
part of speech: noun

04739165-n
type: LexicalConcept
in scheme: en-word.net
definition: an outstanding characteristic
example: his acting was one of the high points of the movie
ili: i61896
lexfile: noun.attribute
part of speech: noun
hypernym: 04738737-n

04739307-n
type: LexicalConcept
in scheme: en-word.net
definition: a distinguishing or individuating characteristic
example: he knows my bad points as well as my good points
ili: i61897
lexfile: noun.attribute
part of speech: noun
hypernym: 04738737-n

pointedness-n
type: LexicalEntry
canonical form: pointedness
sense: 05078725-n
part of speech: noun

05078725-n
type: LexicalConcept
in scheme: en-word.net
definition: the property of a shape that tapers to a sharp tip
ili: i63647
lexfile: noun.attribute
part of speech: noun
hypernym: 05078537-n

detail-n
type: LexicalEntry
canonical form: detail
sense: 05825971-n
part of speech: noun

item-n
type: LexicalEntry
canonical form: item
sense: 05825971-n
part of speech: noun
sense: 06494090-n

05825971-n
type: LexicalConcept
in scheme: en-word.net
definition: an isolated fact that is considered separately from the whole
example: several of the details are similar
example: a point of information
ili: i67453
lexfile: noun.cognition
part of speech: noun
hypernym: 05825522-n

05874582-n
type: LexicalConcept
in scheme: en-word.net
definition: a geometric element that has position but no extension
example: a point is defined by its coordinates
ili: i67705
lexfile: noun.cognition
part of speech: noun
hypernym: 05877576-n

05992951-n
type: LexicalConcept
in scheme: en-word.net
definition: the object of an activity
example: what is the point of discussing it?
ili: i68270
lexfile: noun.cognition
part of speech: noun
hypernym: 05990115-n

06494090-n
type: LexicalConcept
in scheme: en-word.net
definition: a distinct part that can be specified separately in a group of things that could be enumerated on a list
example: he noticed an item in the New York Times
example: she had several items on her shopping list
example: the main point on the agenda was taken up first
ili: i70514
lexfile: noun.communication
part of speech: noun
hypernym: 13831419-n

06619161-n
type: LexicalConcept
in scheme: en-word.net
definition: a brief version of the essential meaning of something
example: get to the point
example: he missed the point of the joke
example: life has lost its point
ili: i71180
lexfile: noun.communication
part of speech: noun
hypernym: 06613680-n

decimal point-n
type: LexicalEntry
canonical form: decimal point
sense: 06825147-n
part of speech: noun

percentage point-n
type: LexicalEntry
canonical form: percentage point
sense: 06825147-n
part of speech: noun

06825147-n
type: LexicalConcept
in scheme: en-word.net
definition: the dot at the left of a decimal fraction
ili: i72293
lexfile: noun.communication
part of speech: noun
hypernym: 06821578-n

head-n
type: LexicalEntry
canonical form: head
sense: 06834918-n
part of speech: noun

06834918-n
type: LexicalConcept
in scheme: en-word.net
definition: a V-shaped mark at one end of an arrow pointer
example: the point of the arrow was due north
ili: i72343
lexfile: noun.communication
part of speech: noun
hypernym: 06830640-n

period-n
type: LexicalEntry
canonical form: period
sense: 06856570-n
part of speech: noun

full stop-n
type: LexicalEntry
canonical form: full stop
sense: 06856570-n
part of speech: noun

stop-n
type: LexicalEntry
canonical form: stop
sense: 06856570-n
part of speech: noun

full point-n
type: LexicalEntry
canonical form: full point
sense: 06856570-n
part of speech: noun

06856570-n
type: LexicalConcept
in scheme: en-word.net
definition: a punctuation mark (‘.’) placed at the end of a declarative sentence to indicate a full stop or after abbreviations
example: in England they call a period a ‘stop’
ili: i72483
lexfile: noun.communication
part of speech: noun
hypernym: 06854415-n

08637636-n
type: LexicalConcept
in scheme: en-word.net
definition: the precise location of something; a spatially limited location
example: she walked to a point where she could survey the whole street
ili: i82287
lexfile: noun.location
part of speech: noun
hypernym: 00027365-n

09419340-n
type: LexicalConcept
in scheme: en-word.net
definition: a promontory extending out into a large body of water
example: they sailed south around the point
ili: i85997
lexfile: noun.object
part of speech: noun
hypernym: 09422467-n

13421323-n
type: LexicalConcept
in scheme: en-word.net
definition: one percent of the total principal of a loan; it is paid at the time the loan is made and is independent of the interest on the loan
ili: i107155
lexfile: noun.possession
part of speech: noun
hypernym: 13420126-n

13631405-n
type: LexicalConcept
in scheme: en-word.net
definition: the unit of counting in scoring a game or contest
example: he scored 20 points in the first half
example: a touchdown counts 6 points
ili: i108201
lexfile: noun.quantity
part of speech: noun
hypernym: 13604927-n

13734391-n
type: LexicalConcept
in scheme: en-word.net
definition: a linear unit used to measure the size of type; approximately 1/72 inch
ili: i108903
lexfile: noun.quantity
part of speech: noun
hypernym: 13624548-n

13817097-n
type: LexicalConcept
in scheme: en-word.net
definition: a style in speech or writing that arrests attention and has a penetrating or convincing quality or effect
ili: i109399
lexfile: noun.relation
part of speech: noun
hypernym: 13816629-n

compass point-n
type: LexicalEntry
canonical form: compass point
sense: 13852504-n
part of speech: noun

13852504-n
type: LexicalConcept
in scheme: en-word.net
definition: any of 32 horizontal directions indicated on the card of a compass
example: he checked the point on his compass
ili: i109587
lexfile: noun.relation
part of speech: noun
hypernym: 13849639-n

tip-n
type: LexicalEntry
canonical form: tip
sense: 13925175-n
part of speech: noun

peak-n
type: LexicalEntry
canonical form: peak
sense: 13925175-n
part of speech: noun

13925175-n
type: LexicalConcept
in scheme: en-word.net
definition: a V shape
example: the cannibal's teeth were filed to sharp points
ili: i110001
lexfile: noun.shape
part of speech: noun
hypernym: 13886774-n

dot-n
type: LexicalEntry
canonical form: dot
sense: 13934887-n
part of speech: noun

13934887-n
type: LexicalConcept
in scheme: en-word.net
definition: a very small circular shape
example: a row of points
example: draw lines between the dots
ili: i110051
lexfile: noun.shape
part of speech: noun
hypernym: 13897824-n

degree-n
type: LexicalEntry
canonical form: degree
sense: 13962925-n
part of speech: noun

level-n
type: LexicalEntry
canonical form: level
sense: 13962925-n
part of speech: noun

stage-n
type: LexicalEntry
canonical form: stage
sense: 13962925-n
part of speech: noun

13962925-n
type: LexicalConcept
in scheme: en-word.net
definition: a specific identifiable position in a continuum or series or especially in a process
example: a remarkable degree of frankness
example: at what stage are the social sciences?
ili: i110200
lexfile: noun.state
part of speech: noun
hypernym: 00024900-n

point in time-n
type: LexicalEntry
canonical form: point in time
sense: 15205381-n
part of speech: noun

15205381-n
type: LexicalConcept
in scheme: en-word.net
definition: an instant of time
example: at that point I had to leave
ili: i116986
lexfile: noun.time
part of speech: noun
hypernym: 00033914-n