plant process-n
type: LexicalEntry
canonical form: plant process
sense: 13108856-n
part of speech: noun

enation-n
type: LexicalEntry
canonical form: enation
sense: 13108856-n
part of speech: noun

13108856-n
type: LexicalConcept
in scheme: en-word.net
definition: a natural projection or outgrowth from a plant body or organ
ili: i105486
lexfile: noun.plant
part of speech: noun
hypernym: 05477841-n