pitilessness-n
type: LexicalEntry
canonical form: pitilessness
sense: 04838495-n
part of speech: noun
sense: 07521621-n

ruthlessness-n
type: LexicalEntry
canonical form: ruthlessness
sense: 04838495-n
part of speech: noun
sense: 07521621-n

04838495-n
type: LexicalConcept
in scheme: en-word.net
definition: mercilessness characterized by a lack of pity
ili: i62382
lexfile: noun.attribute
part of speech: noun
hypernym: 04838262-n

cruelty-n
type: LexicalEntry
canonical form: cruelty
sense: 07521621-n
part of speech: noun

mercilessness-n
type: LexicalEntry
canonical form: mercilessness
sense: 07521621-n
part of speech: noun

07521621-n
type: LexicalConcept
in scheme: en-word.net
definition: feelings of extreme heartlessness
ili: i76195
lexfile: noun.feeling
part of speech: noun
hypernym: 07521388-n