pirouette-n
type: LexicalEntry
canonical form: pirouette
sense: 00344556-n
part of speech: noun

00344556-n
type: LexicalConcept
in scheme: en-word.net
definition: (ballet) a rapid spin of the body (especially on the toes as in ballet)
ili: i37216
lexfile: noun.act
part of speech: noun
domain topic: 00529704-n
hypernym: 00344075-n

pirouette-v
type: LexicalEntry
canonical form: pirouette
sense: 02052333-v
part of speech: verb

02052333-v
type: LexicalConcept
in scheme: en-word.net
definition: do a pirouette, usually as part of a dance
ili: i31986
lexfile: verb.motion
part of speech: verb
hypernym: 02050521-v