organ-n
type: LexicalEntry
canonical form: organ
sense: 03859585-n
part of speech: noun

pipe organ-n
type: LexicalEntry
canonical form: pipe organ
sense: 03859585-n
part of speech: noun

03859585-n
type: LexicalConcept
in scheme: en-word.net
definition: wind instrument whose sound is produced by means of pipes arranged in sets supplied with air from a bellows and controlled from a large complex musical keyboard
ili: i56771
lexfile: noun.artifact
part of speech: noun
hypernym: 03619741-n
hypernym: 04594218-n
mero part: 03619216-n
mero part: 03860335-n
mero part: 03909502-n
mero part: 03935052-n
mero part: 04334462-n