petrify-v
type: LexicalEntry
canonical form: petrify
sense: 00192803-v
part of speech: verb
sense: 00419035-v
sense: 00508566-v

00192803-v
type: LexicalConcept
in scheme: en-word.net
definition: cause to become stonelike or stiff or dazed and stunned from fright
example: The horror petrified his feelings
example: Fear petrified her thinking
ili: i22680
lexfile: verb.change
part of speech: verb
hypernym: 00192383-v

rigidify-v
type: LexicalEntry
canonical form: rigidify
sense: 00419035-v
part of speech: verb

ossify-v
type: LexicalEntry
canonical form: ossify
sense: 00419035-v
part of speech: verb

00419035-v
type: LexicalConcept
in scheme: en-word.net
definition: make rigid and set into a conventional pattern
example: rigidify the training schedule
example: ossified teaching methods
example: slogans petrify our thinking
ili: i23814
lexfile: verb.change
part of speech: verb
hypernym: 00418521-v

lapidify-v
type: LexicalEntry
canonical form: lapidify
sense: 00508566-v
part of speech: verb

00508566-v
type: LexicalConcept
in scheme: en-word.net
definition: change into stone
example: the wood petrified with time
ili: i24251
lexfile: verb.change
part of speech: verb
hypernym: 00508745-v