performance-n
type: LexicalEntry
canonical form: performance
sense: 00047847-n
part of speech: noun
sense: 00098324-n
sense: 00551808-n
sense: 06904543-n
sense: 13546752-n

00047847-n
type: LexicalConcept
in scheme: en-word.net
definition: any recognized accomplishment
example: they admired his performance under stress
example: when Roger Maris powered four home runs in one game, his performance merits awe
ili: i35651
lexfile: noun.act
part of speech: noun
hypernym: 00035910-n

execution-n
type: LexicalEntry
canonical form: execution
sense: 00098324-n
part of speech: noun

carrying out-n
type: LexicalEntry
canonical form: carrying out
sense: 00098324-n
part of speech: noun

carrying into action-n
type: LexicalEntry
canonical form: carrying into action
sense: 00098324-n
part of speech: noun

00098324-n
type: LexicalConcept
in scheme: en-word.net
definition: the act of performing; of doing something successfully; using knowledge as distinguished from merely possessing it
example: they criticized his performance as mayor
example: experience generally improves performance
ili: i35917
lexfile: noun.act
part of speech: noun
hypernym: 00038116-n

00551808-n
type: LexicalConcept
in scheme: en-word.net
definition: the act of presenting a play or a piece of music or other entertainment
example: we congratulated him on his performance at the rehearsal
example: an inspired performance of Mozart's C minor concerto
ili: i38285
lexfile: noun.act
part of speech: noun
hypernym: 00522618-n
mero part: 00549363-n

public presentation-n
type: LexicalEntry
canonical form: public presentation
sense: 06904543-n
part of speech: noun

06904543-n
type: LexicalConcept
in scheme: en-word.net
definition: a dramatic or musical entertainment
example: they listened to ten different performances
example: the play ran for 100 performances
example: the frequent performances of the symphony testify to its popularity
ili: i72717
lexfile: noun.communication
part of speech: noun
hypernym: 00521313-n
mero part: 07053224-n

operation-n
type: LexicalEntry
canonical form: operation
sense: 13546752-n
part of speech: noun

functioning-n
type: LexicalEntry
canonical form: functioning
sense: 13546752-n
part of speech: noun

13546752-n
type: LexicalConcept
in scheme: en-word.net
definition: process or manner of functioning or operating
example: the power of its engine determines its operation
example: the plane's operation in high winds
example: they compared the cooking performance of each oven
example: the jet's performance conformed to high standards
ili: i107796
lexfile: noun.process
part of speech: noun
hypernym: 00029976-n