pepper-v
type: LexicalEntry
canonical form: pepper
sense: 01123738-v
part of speech: verb
sense: 02200527-v

pelt-v
type: LexicalEntry
canonical form: pelt
sense: 01123738-v
part of speech: verb

01123738-v
type: LexicalConcept
in scheme: en-word.net
definition: attack and bombard with or as if with missiles
example: pelt the speaker with questions
ili: i27203
lexfile: verb.competition
part of speech: verb
entails: 01511000-v
hypernym: 01121587-v

02200527-v
type: LexicalConcept
in scheme: en-word.net
definition: add pepper to
example: pepper the soup
ili: i32734
lexfile: verb.perception
part of speech: verb
domain topic: 00244785-n
hypernym: 02197016-v

pepper-n
type: LexicalEntry
canonical form: pepper
sense: 07736187-n
part of speech: noun
sense: 07831564-n
sense: 12921222-n
sense: 13170289-n

07736187-n
type: LexicalConcept
in scheme: en-word.net
definition: sweet and hot varieties of fruits of plants of the genus Capsicum
ili: i77580
lexfile: noun.food
part of speech: noun
hypernym: 07725752-n

peppercorn-n
type: LexicalEntry
canonical form: peppercorn
sense: 07831564-n
part of speech: noun

07831564-n
type: LexicalConcept
in scheme: en-word.net
definition: pungent seasoning from the berry of the common pepper plant of East India; use whole or ground
ili: i78192
lexfile: noun.food
part of speech: noun
hypernym: 07825344-n

capsicum-n
type: LexicalEntry
canonical form: capsicum
sense: 12921222-n
part of speech: noun

capsicum pepper plant-n
type: LexicalEntry
canonical form: capsicum pepper plant
sense: 12921222-n
part of speech: noun

12921222-n
type: LexicalConcept
in scheme: en-word.net
definition: any of various tropical plants of the genus Capsicum bearing peppers
ili: i104563
lexfile: noun.plant
part of speech: noun
hypernym: 13133423-n
mero part: 07736187-n
mero substance: 15057396-n

common pepper-n
type: LexicalEntry
canonical form: common pepper
sense: 13170289-n
part of speech: noun

black pepper-n
type: LexicalEntry
canonical form: black pepper
sense: 13170289-n
part of speech: noun

white pepper-n
type: LexicalEntry
canonical form: white pepper
sense: 13170289-n
part of speech: noun

Madagascar pepper-n
type: LexicalEntry
canonical form: Madagascar pepper
sense: 13170289-n
part of speech: noun

Piper nigrum-n
type: LexicalEntry
canonical form: Piper nigrum
sense: 13170289-n
part of speech: noun

13170289-n
type: LexicalConcept
in scheme: en-word.net
definition: climber having dark red berries (peppercorns) when fully ripe; southern India and Sri Lanka; naturalized in northern Burma and Assam
ili: i105749
lexfile: noun.plant
part of speech: noun
hypernym: 13170079-n
mero part: 07831564-n
mero substance: 15057756-n