patched-a
type: LexicalEntry
canonical form: patched
sense: 01644583-s
part of speech: adjective
sense: 01793990-s

01644583-s
type: LexicalConcept
in scheme: en-word.net
definition: mended usually clumsily by covering a hole with a patch
example: patched jeans
ili: i8979
lexfile: adj.all
part of speech: adjective satellite
similar: https://en-word.net/synset/01642580-a

spotty-a
type: LexicalEntry
canonical form: spotty
sense: 01793990-s
part of speech: adjective

spotted-a
type: LexicalEntry
canonical form: spotted
sense: 01793990-s
part of speech: adjective

01793990-s
type: LexicalConcept
in scheme: en-word.net
definition: having spots or patches (small areas of contrasting color or texture)
example: a field patched with ice and snow
example: the wall had a spotty speckled effect
example: a black-and-white spotted cow
ili: i9823
lexfile: adj.all
part of speech: adjective satellite
similar: https://en-word.net/synset/01790642-a