wall-n
type: LexicalEntry
canonical form: wall
sense: 05612009-n
part of speech: noun

paries-n
type: LexicalEntry
canonical form: paries
sense: 05612009-n
part of speech: noun

05612009-n
type: LexicalConcept
in scheme: en-word.net
definition: (anatomy) a layer (a lining or membrane) that encloses a structure
example: stomach walls
ili: i66361
lexfile: noun.body
part of speech: noun
domain topic: 06067070-n
hypernym: 08674880-n