paleogeography-n
type: LexicalEntry
canonical form: paleogeography
sense: 06154897-n
part of speech: noun

palaeogeography-n
type: LexicalEntry
canonical form: palaeogeography
sense: 06154897-n
part of speech: noun

06154897-n
type: LexicalConcept
in scheme: en-word.net
definition: the study of the geography of ancient times or ancient epochs
ili: i68869
lexfile: noun.cognition
part of speech: noun
hypernym: 06153532-n