cougar-n
type: LexicalEntry
canonical form: cougar
sense: 02127963-n
part of speech: noun

puma-n
type: LexicalEntry
canonical form: puma
sense: 02127963-n
part of speech: noun

catamount-n
type: LexicalEntry
canonical form: catamount
sense: 02127963-n
part of speech: noun

mountain lion-n
type: LexicalEntry
canonical form: mountain lion
sense: 02127963-n
part of speech: noun

painter-n
type: LexicalEntry
canonical form: painter
sense: 02127963-n
part of speech: noun
sense: 03882030-n
sense: 10411352-n
sense: 10413608-n

panther-n
type: LexicalEntry
canonical form: panther
sense: 02127963-n
part of speech: noun

Felis concolor-n
type: LexicalEntry
canonical form: Felis concolor
sense: 02127963-n
part of speech: noun

02127963-n
type: LexicalConcept
in scheme: en-word.net
definition: large American feline resembling a lion
ili: i46618
lexfile: noun.animal
part of speech: noun
hypernym: 02127275-n

03882030-n
type: LexicalConcept
in scheme: en-word.net
definition: a line that is attached to the bow of a boat and used for tying up (as when docking or towing)
ili: i56910
lexfile: noun.artifact
part of speech: noun
domain topic: 02861626-n
hypernym: 03676175-n

10411352-n
type: LexicalConcept
in scheme: en-word.net
definition: an artist who paints
ili: i91823
lexfile: noun.person
part of speech: noun
hypernym: 09831743-n

10413608-n
type: LexicalConcept
in scheme: en-word.net
definition: a worker who is employed to cover objects with paint
ili: i91824
lexfile: noun.person
part of speech: noun
hypernym: 10625393-n