oxygen mask-n
type: LexicalEntry
canonical form: oxygen mask
sense: 03874541-n
part of speech: noun

03874541-n
type: LexicalConcept
in scheme: en-word.net
definition: a breathing device that is placed over the mouth and nose; supplies oxygen from an attached storage tank
ili: i56865
lexfile: noun.artifact
part of speech: noun
hypernym: 02898868-n