order-v
type: LexicalEntry
canonical form: order
sense: 00277653-v
part of speech: verb
sense: 00278429-v
sense: 00659723-v
sense: 00737576-v
sense: 00747485-v
sense: 00748704-v
sense: 00749139-v
sense: 02391154-v
sense: 02517217-v

00277653-v
type: LexicalConcept
in scheme: en-word.net
definition: place in a certain order
example: order the photos chronologically
ili: i23102
lexfile: verb.change
part of speech: verb
hypernym: 01466592-v

00278429-v
type: LexicalConcept
in scheme: en-word.net
definition: bring order to or into
example: Order these files
ili: i23106
lexfile: verb.change
part of speech: verb
hypernym: 01466592-v

rate-v
type: LexicalEntry
canonical form: rate
sense: 00659723-v
part of speech: verb

rank-v
type: LexicalEntry
canonical form: rank
sense: 00659723-v
part of speech: verb

range-v
type: LexicalEntry
canonical form: range
sense: 00659723-v
part of speech: verb

grade-v
type: LexicalEntry
canonical form: grade
sense: 00659723-v
part of speech: verb

place-v
type: LexicalEntry
canonical form: place
sense: 00659723-v
part of speech: verb

00659723-v
type: LexicalConcept
in scheme: en-word.net
definition: assign a rank or rating to
example: how would you rank these students?
example: The restaurant is rated highly in the food guide
ili: i25016
lexfile: verb.cognition
part of speech: verb
hypernym: 00672179-v

arrange-v
type: LexicalEntry
canonical form: arrange
sense: 00737576-v
part of speech: verb

set up-v
type: LexicalEntry
canonical form: set up
sense: 00737576-v
part of speech: verb

put-v
type: LexicalEntry
canonical form: put
sense: 00737576-v
part of speech: verb

00737576-v
type: LexicalConcept
in scheme: en-word.net
definition: arrange thoughts, ideas, temporal events
example: arrange my schedule
example: set up one's life
example: I put these memories with those of bygone times
ili: i25377
lexfile: verb.cognition
part of speech: verb
hypernym: 02437377-v

00747485-v
type: LexicalConcept
in scheme: en-word.net
definition: make a request for something
example: Order me some flowers
example: order a work stoppage
ili: i25425
lexfile: verb.communication
part of speech: verb
hypernym: 00754770-v

tell-v
type: LexicalEntry
canonical form: tell
sense: 00748704-v
part of speech: verb

enjoin-v
type: LexicalEntry
canonical form: enjoin
sense: 00748704-v
part of speech: verb

say-v
type: LexicalEntry
canonical form: say
sense: 00748704-v
part of speech: verb

00748704-v
type: LexicalConcept
in scheme: en-word.net
definition: give instructions to or direct somebody to do something with authority
example: I said to him to go home
example: She ordered him to do the shopping
example: The mother told the child to get dressed
ili: i25432
lexfile: verb.communication
part of speech: verb
hypernym: 00755473-v

prescribe-v
type: LexicalEntry
canonical form: prescribe
sense: 00749139-v
part of speech: verb

dictate-v
type: LexicalEntry
canonical form: dictate
sense: 00749139-v
part of speech: verb

00749139-v
type: LexicalConcept
in scheme: en-word.net
definition: issue commands or orders for
ili: i25433
lexfile: verb.communication
part of speech: verb
hypernym: 00750288-v

order-n
type: LexicalEntry
canonical form: order
sense: 01011813-n
part of speech: noun
sense: 04706004-n
sense: 05098520-n
sense: 06541210-n
sense: 06551761-n
sense: 06665623-n
sense: 07183274-n
sense: 07294392-n
sense: 08123900-n
sense: 08164801-n
sense: 08244135-n
sense: 08474004-n
sense: 13991994-n
sense: 14520294-n

ordering-n
type: LexicalEntry
canonical form: ordering
sense: 01011813-n
part of speech: noun
sense: 08474004-n

01011813-n
type: LexicalConcept
in scheme: en-word.net
definition: the act of putting things in a sequential arrangement
example: there were mistakes in the ordering of items on the list
ili: i40691
lexfile: noun.act
part of speech: noun
hypernym: 01010320-n

ordain-v
type: LexicalEntry
canonical form: ordain
sense: 02391154-v
part of speech: verb

consecrate-v
type: LexicalEntry
canonical form: consecrate
sense: 02391154-v
part of speech: verb

ordinate-v
type: LexicalEntry
canonical form: ordinate
sense: 02391154-v
part of speech: verb

02391154-v
type: LexicalConcept
in scheme: en-word.net
definition: appoint to a clerical posts
example: he was ordained in the Church
ili: i33683
lexfile: verb.social
part of speech: verb
hypernym: 02391530-v

regulate-v
type: LexicalEntry
canonical form: regulate
sense: 02517217-v
part of speech: verb

regularize-v
type: LexicalEntry
canonical form: regularize
sense: 02517217-v
part of speech: verb

regularise-v
type: LexicalEntry
canonical form: regularise
sense: 02517217-v
part of speech: verb

govern-v
type: LexicalEntry
canonical form: govern
sense: 02517217-v
part of speech: verb

02517217-v
type: LexicalConcept
in scheme: en-word.net
definition: bring into conformity with rules or principles or usage; impose regulations
example: We cannot regulate the way people dress
example: This town likes to regulate
ili: i34271
lexfile: verb.social
part of speech: verb
hypernym: 00699355-v

04706004-n
type: LexicalConcept
in scheme: en-word.net
definition: (architecture) one of original three styles of Greek architecture distinguished by the type of column and entablature used or a style developed from the original three by the Romans
ili: i61750
lexfile: noun.attribute
part of speech: noun
domain topic: 06132970-n
hypernym: 04936599-n

order of magnitude-n
type: LexicalEntry
canonical form: order of magnitude
sense: 05098520-n
part of speech: noun

05098520-n
type: LexicalConcept
in scheme: en-word.net
definition: a degree in a continuum of size or quantity
example: it was on the order of a mile
example: an explosion of a low order of magnitude
ili: i63750
lexfile: noun.attribute
part of speech: noun
hypernym: 05097645-n

purchase order-n
type: LexicalEntry
canonical form: purchase order
sense: 06541210-n
part of speech: noun

06541210-n
type: LexicalConcept
in scheme: en-word.net
definition: a commercial document used to request someone to supply something in return for payment and providing specifications and quantities
example: IBM received an order for a hundred computers
ili: i70778
lexfile: noun.communication
part of speech: noun
hypernym: 06483696-n

decree-n
type: LexicalEntry
canonical form: decree
sense: 06551761-n
part of speech: noun

edict-n
type: LexicalEntry
canonical form: edict
sense: 06551761-n
part of speech: noun

fiat-n
type: LexicalEntry
canonical form: fiat
sense: 06551761-n
part of speech: noun

rescript-n
type: LexicalEntry
canonical form: rescript
sense: 06551761-n
part of speech: noun

06551761-n
type: LexicalConcept
in scheme: en-word.net
definition: a legally binding command or decision entered on the court record (as if issued by a court or judge)
example: a friend in New Mexico said that the order caused no trouble out there
ili: i70833
lexfile: noun.communication
part of speech: noun
domain topic: 08458195-n
hypernym: 06544086-n

rules of order-n
type: LexicalEntry
canonical form: rules of order
sense: 06665623-n
part of speech: noun

parliamentary law-n
type: LexicalEntry
canonical form: parliamentary law
sense: 06665623-n
part of speech: noun

parliamentary procedure-n
type: LexicalEntry
canonical form: parliamentary procedure
sense: 06665623-n
part of speech: noun

06665623-n
type: LexicalConcept
in scheme: en-word.net
definition: a body of rules followed by an assembly
ili: i71442
lexfile: noun.communication
part of speech: noun
hypernym: 06664987-n

07183274-n
type: LexicalConcept
in scheme: en-word.net
definition: (often plural) a command given by a superior (e.g., a military or law enforcement officer) that must be obeyed
example: the British ships dropped anchor and waited for orders from London
ili: i74324
lexfile: noun.communication
part of speech: noun
domain topic: 08215965-n
exemplifies: 06306016-n
hypernym: 07182782-n

07294392-n
type: LexicalConcept
in scheme: en-word.net
definition: a request for something to be made, supplied, or served
example: I gave the waiter my order
example: the company's products were in such demand that they got more orders than their call center could handle
ili: i74946
lexfile: noun.communication
part of speech: noun
hypernym: 07199985-n

08123900-n
type: LexicalConcept
in scheme: en-word.net
definition: (biology) taxonomic group containing one or more families
ili: i79791
lexfile: noun.group
part of speech: noun
domain topic: 06047178-n
hypernym: 08008892-n
mero member: 08124157-n
mero member: 08124465-n

monastic order-n
type: LexicalEntry
canonical form: monastic order
sense: 08164801-n
part of speech: noun

08164801-n
type: LexicalConcept
in scheme: en-word.net
definition: a group of person living under a religious rule
example: the order of Saint Benedict
ili: i79972
lexfile: noun.group
part of speech: noun
hypernym: 08166788-n

club-n
type: LexicalEntry
canonical form: club
sense: 08244135-n
part of speech: noun

social club-n
type: LexicalEntry
canonical form: social club
sense: 08244135-n
part of speech: noun

society-n
type: LexicalEntry
canonical form: society
sense: 08244135-n
part of speech: noun

guild-n
type: LexicalEntry
canonical form: guild
sense: 08244135-n
part of speech: noun

gild-n
type: LexicalEntry
canonical form: gild
sense: 08244135-n
part of speech: noun

lodge-n
type: LexicalEntry
canonical form: lodge
sense: 08244135-n
part of speech: noun

08244135-n
type: LexicalConcept
in scheme: en-word.net
definition: a formal association of people with similar interests
example: he joined a golf club
example: they formed a small lunch society
example: men from the fraternal order will staff the soup kitchen today
ili: i80347
lexfile: noun.group
part of speech: noun
hypernym: 08066153-n
mero member: 10328061-n

ordination-n
type: LexicalEntry
canonical form: ordination
sense: 08474004-n
part of speech: noun

08474004-n
type: LexicalConcept
in scheme: en-word.net
definition: logical or comprehensible arrangement of separate elements
example: we shall consider these questions in the inverse order of their presentation
ili: i81500
lexfile: noun.group
part of speech: noun
hypernym: 07955013-n

13991994-n
type: LexicalConcept
in scheme: en-word.net
definition: established customary state (especially of society)
example: order ruled in the streets
example: law and order
ili: i110342
lexfile: noun.state
part of speech: noun
hypernym: 00024900-n

orderliness-n
type: LexicalEntry
canonical form: orderliness
sense: 14520294-n
part of speech: noun

14520294-n
type: LexicalConcept
in scheme: en-word.net
definition: a condition of regular or proper arrangement
example: he put his desk in order
example: the machine is now in working order
ili: i113186
lexfile: noun.state
part of speech: noun
hypernym: 13943868-n