hustler-n
type: LexicalEntry
canonical form: hustler
sense: 10214185-n
part of speech: noun

wheeler dealer-n
type: LexicalEntry
canonical form: wheeler dealer
sense: 10214185-n
part of speech: noun

operator-n
type: LexicalEntry
canonical form: operator
sense: 10214185-n
part of speech: noun
sense: 10398111-n
sense: 10398479-n
sense: 10398651-n
sense: 13808625-n

10214185-n
type: LexicalConcept
in scheme: en-word.net
definition: a shrewd or unscrupulous person who knows how to circumvent difficulties
ili: i90630
lexfile: noun.person
part of speech: noun
exemplifies: 07089193-n
exemplifies: 06730109-n
hypernym: 10399075-n

manipulator-n
type: LexicalEntry
canonical form: manipulator
sense: 10398111-n
part of speech: noun

10398111-n
type: LexicalConcept
in scheme: en-word.net
definition: an agent that operates some apparatus or machine
example: the operator of the switchboard
ili: i91742
lexfile: noun.person
part of speech: noun
hypernym: 00007347-n

10398479-n
type: LexicalConcept
in scheme: en-word.net
definition: someone who owns or operates a business
example: who is the operator of this franchise?
ili: i91743
lexfile: noun.person
part of speech: noun
hypernym: 09902168-n

10398651-n
type: LexicalConcept
in scheme: en-word.net
definition: a speculator who trades aggressively on stock or commodity markets
ili: i91744
lexfile: noun.person
part of speech: noun
hypernym: 10653473-n

13808625-n
type: LexicalConcept
in scheme: en-word.net
definition: (mathematics) a symbol or function representing a mathematical operation
ili: i109354
lexfile: noun.relation
part of speech: noun
domain topic: 06009822-n
hypernym: 13806028-n