funeral-n
type: LexicalEntry
canonical form: funeral
sense: 07466063-n
part of speech: noun

obsequy-n
type: LexicalEntry
canonical form: obsequy
sense: 07466063-n
part of speech: noun

07466063-n
type: LexicalConcept
in scheme: en-word.net
definition: a ceremony at which a dead person is buried or cremated
example: hundreds of people attended his funeral
ili: i75873
lexfile: noun.event
part of speech: noun
hypernym: 07465442-n