mass number-n
type: LexicalEntry
canonical form: mass number
sense: 13737719-n
part of speech: noun

nucleon number-n
type: LexicalEntry
canonical form: nucleon number
sense: 13737719-n
part of speech: noun

13737719-n
type: LexicalConcept
in scheme: en-word.net
definition: the sum of the number of neutrons and protons in an atomic nucleus
ili: i108927
lexfile: noun.quantity
part of speech: noun
hypernym: 13630457-n