nominal-a
type: LexicalEntry
canonical form: nominal
sense: 01047056-s
part of speech: adjective
sense: 01103503-s
sense: 01499887-s
sense: https://en-word.net/lemma/nominal-a#01946401-a
sense: https://en-word.net/lemma/nominal-a#02779730-a
sense: https://en-word.net/lemma/nominal-a#02779900-a

titular-a
type: LexicalEntry
canonical form: titular
sense: 01047056-s
part of speech: adjective

01047056-s
type: LexicalConcept
in scheme: en-word.net
definition: existing in name only
example: the nominal (or titular) head of his party
ili: i5714
lexfile: adj.all
part of speech: adjective satellite
similar: https://en-word.net/synset/01045598-a

nominative-a
type: LexicalEntry
canonical form: nominative
sense: 01103503-s
part of speech: adjective

01103503-s
type: LexicalConcept
in scheme: en-word.net
definition: named; bearing the name of a specific person
example: nominative shares of stock
ili: i6048
lexfile: adj.all
part of speech: adjective satellite
similar: https://en-word.net/synset/01103229-a

token-a
type: LexicalEntry
canonical form: token
sense: 01499887-s
part of speech: adjective

tokenish-a
type: LexicalEntry
canonical form: tokenish
sense: 01499887-s
part of speech: adjective

01499887-s
type: LexicalConcept
in scheme: en-word.net
definition: insignificantly small; a matter of form only (‘tokenish’ is informal)
example: the fee was nominal
example: a token gesture of resistance
example: a tokenish gesture
ili: i8210
lexfile: adj.all
part of speech: adjective satellite
similar: https://en-word.net/synset/01499316-a

https://en-word.net/synset/01946401-a
type: LexicalConcept
in scheme: en-word.net
definition: of, relating to, or characteristic of an amount that is not adjusted for inflation
example: the nominal GDP
example: nominal interest rates
ili: i10624
lexfile: adj.all
part of speech: adjective
domain topic: 06158935-n

https://en-word.net/synset/02779730-a
type: LexicalConcept
in scheme: en-word.net
definition: pertaining to a noun or to a word group that functions as a noun
example: nominal phrase
ili: i15638
lexfile: adj.pert
part of speech: adjective
domain topic: 06184139-n

https://en-word.net/synset/02779900-a
type: LexicalConcept
in scheme: en-word.net
definition: relating to or constituting or bearing or giving a name
example: the Russian system of nominal brevity
example: a nominal list of priests
example: taxable males as revealed by the nominal rolls
ili: i15639
lexfile: adj.pert
part of speech: adjective

noun phrase-n
type: LexicalEntry
canonical form: noun phrase
sense: 06327473-n
part of speech: noun

nominal phrase-n
type: LexicalEntry
canonical form: nominal phrase
sense: 06327473-n
part of speech: noun

nominal-n
type: LexicalEntry
canonical form: nominal
sense: 06327473-n
part of speech: noun

06327473-n
type: LexicalConcept
in scheme: en-word.net
definition: a phrase that can function as the subject or object of a verb
ili: i69674
lexfile: noun.communication
part of speech: noun
hypernym: 06327041-n