nitrify-v
type: LexicalEntry
canonical form: nitrify
sense: 00503559-v
part of speech: verb
sense: 00505757-v
sense: 00505982-v

00503559-v
type: LexicalConcept
in scheme: en-word.net
definition: treat (soil) with nitrates
ili: i24224
lexfile: verb.change
part of speech: verb
hypernym: 00503838-v

nitrogenize-v
type: LexicalEntry
canonical form: nitrogenize
sense: 00505757-v
part of speech: verb

nitrogenise-v
type: LexicalEntry
canonical form: nitrogenise
sense: 00505757-v
part of speech: verb

00505757-v
type: LexicalConcept
in scheme: en-word.net
definition: treat with nitrogen or a nitrogen compound
ili: i24234
lexfile: verb.change
part of speech: verb
hypernym: 00516235-v

00505982-v
type: LexicalConcept
in scheme: en-word.net
definition: convert into nitric acid, nitrous acid, or nitrate, especially with the action of nitrobacteria
ili: i24235
lexfile: verb.change
part of speech: verb
entails: 00239753-v
hypernym: 00114965-v