nickel-v
type: LexicalEntry
canonical form: nickel
sense: 01398317-v
part of speech: verb

01398317-v
type: LexicalConcept
in scheme: en-word.net
definition: plate with nickel
example: nickel the plate
ili: i28697
lexfile: verb.contact
part of speech: verb
hypernym: 01397703-v

nickel-n
type: LexicalEntry
canonical form: nickel
sense: 13411312-n
part of speech: noun
sense: 13416825-n
sense: 14670788-n

13411312-n
type: LexicalConcept
in scheme: en-word.net
definition: a United States coin worth one twentieth of a dollar
ili: i107087
lexfile: noun.possession
part of speech: noun
hypernym: 13409418-n

nickel note-n
type: LexicalEntry
canonical form: nickel note
sense: 13416825-n
part of speech: noun

13416825-n
type: LexicalConcept
in scheme: en-word.net
definition: five dollars worth of a drug
example: a nickel bag of drugs
example: a nickel deck of heroin
ili: i107129
lexfile: noun.possession
part of speech: noun
hypernym: 13416688-n

Ni-n
type: LexicalEntry
canonical form: Ni
sense: 14670788-n
part of speech: noun

atomic number 28-n
type: LexicalEntry
canonical form: atomic number 28
sense: 14670788-n
part of speech: noun

14670788-n
type: LexicalConcept
in scheme: en-word.net
definition: a hard malleable ductile silvery metallic element that is resistant to corrosion; used in alloys; occurs in pentlandite and smaltite and garnierite and millerite
ili: i113971
lexfile: noun.substance
part of speech: noun
hypernym: 14649636-n