neutral spirits-n
type: LexicalEntry
canonical form: neutral spirits
sense: 07918361-n
part of speech: noun

ethyl alcohol-n
type: LexicalEntry
canonical form: ethyl alcohol
sense: 07918361-n
part of speech: noun

07918361-n
type: LexicalConcept
in scheme: en-word.net
definition: nonflavored alcohol of 95 percent or 190 proof used for blending with straight whiskies and in making gin and liqueurs
ili: i78782
lexfile: noun.food
part of speech: noun
hypernym: 07900542-n
mero substance: 14733426-n