twang-n
type: LexicalEntry
canonical form: twang
sense: 04996748-n
part of speech: noun

nasal twang-n
type: LexicalEntry
canonical form: nasal twang
sense: 04996748-n
part of speech: noun

04996748-n
type: LexicalConcept
in scheme: en-word.net
definition: exaggerated nasality in speech (as in some regional dialects)
ili: i63222
lexfile: noun.attribute
part of speech: noun
hypernym: 04996598-n