nasal consonant-n
type: LexicalEntry
canonical form: nasal consonant
sense: 07133919-n
part of speech: noun

nasal-n
type: LexicalEntry
canonical form: nasal
sense: 07133919-n
part of speech: noun

07133919-n
type: LexicalConcept
in scheme: en-word.net
definition: a consonant produced through the nose with the mouth closed
ili: i74073
lexfile: noun.communication
part of speech: noun
hypernym: 07129729-n