myriapod-n
type: LexicalEntry
canonical form: myriapod
sense: 01785658-n
part of speech: noun

01785658-n
type: LexicalConcept
in scheme: en-word.net
definition: general term for any terrestrial arthropod having an elongated body composed of many similar segments: e.g. centipedes and millipedes
ili: i44660
lexfile: noun.animal
part of speech: noun
hypernym: 01770302-n